Error java identifier expected

For an < identifier> expected message,. I have this error after watching exactly someone was doing on YT in a tutorial. His worked but mine didn' t. Heres my code [ code] package b. Looks like you forgot to add semi- colons to the end of some of your statements: System. println( " Please enter your first name" ) ; System. println( " Please enter your family name" ) ; first_ name = user_ input. · You need to format your code better with consistent and proper indentation, not so it will look pretty ( that' s just an added bonus), but doing this will help you see. Can anybody tell me why I keep getting this error? [ CODE] Asig02_ Attempt2. java: 37: < identifier>. Bana göre bir sorun gözükmüyor ama programı çalıştırdığımda " Identifier expected" hata mesajını alıyorum ve. error C: undeclared gram1_.

  • Kubernetes error malformed response
  • Jsp processing error 404 websphere
  • Que hacer cuando aparece error 404
  • Error 1040 mysql too many connection


  • Video:Expected java identifier

    Identifier expected java

    java: 17: error: < identifier> expected Public static void main( String [ ] args) ^ Program1_ java: 20: error: illegal line end in character literal. · I have two other classes, but this is the main class where I' m getting and identifier expected error. This is my code: import java. ru / Ошибка " < identifier> expected". Буквально на прошлой неделе увлекся ява- программированием: ). Diskutiere Blue J - Fehlermeldung - identifier expected - illegal start im Forum Java Basics - Anfänger- Themen - Hallo, ich benutze momentan das Programm BlueJ und. Identifier expected. 07/ 20/ ; 2 minutes to read. To correct this error. Verify that any attributes in the statement are all placed at the beginning. Hello, I tried to follow a link to answer this question but it was gone. I am getting an identifier expected error ( I am using BlueJ) and I am prett. · java: 23: error: identifier expected java: 63: error: cannot find symbol java: 51: error: cannot find symbol java: 50: error: cannot find symbol java: 39: error. · Diskutiere < identifier> expected im Forum Java Basics - Anfänger- Themen - import java.

    Color; public class Auto {. · However, I' m getting an Identifier expected error and I don' t know what I' m doing wrong. ( 19, 36) ; error CS1041: Identifier expected My code is now:. 普通は識別子がない場合にでるコンパイルエラーです。 このエラーが出るということは Javaの書式に従っていないなどコーディングミスがどこかにあるはずです、 エラーの表示 された行のソースを良く眺めて見るとわかると思います。. · Identifier Expected. This Site Might Help You. RE: How can I fix error: & lt; identifier& gt; expected in java? Here' s my code; my error seems to. 今天突然发现项目中引入的 jquery- 3. js 报错了, 其中一行: syntax error on token “ catch” , Identifier expected我用的是sts工具, 搜索. Expected identifier ( JavaScript). You used something other than an identifier in a context where one was required. Liquid error: Can' t find the. Participate in discussions with other Treehouse members and learn.

    error: < identifier> expected Hi I dont get why I get this error. java: 31: error:. public static void sort( ArrayList objects, Comparator< Car> identifier). You missed the argument name in the function parameters. I am a new learner of Java. I learned some of the Java core concepts. I got the identifier expected error when run my following code: class Sekar { public static int i, j, k; i = 900; static void max( ) { j = 100; if( i> j) { k= i; } else { k= j; }. Java: Identifier expected. Java Compilation error 12 : error: < identifier> expected : Initializing and declaring of variable in separate statement. Javaのidentifierとは識別子のことだ。 エラーで出てくるメッセージも多くは識別子に なんらかの問題があることを示している。 変数やメソッド名を一度確認してみよう。 他にも 原因はあるので、 このページではもう少々詳しくJavaのidentifier. Olá, eu comecei a aprender java na faculdade agora e estou tentando fazer um programinha simples pelo bloco de notas e rodando. · Whilst attempting to loop a menu in a program which I am working on Iam getting the error of " identifier expected". What I want to do is to get the.

    You have not defined a method around your code. * ; public class details { public static void main( String[ ] args ) { BufferedReader in = new BufferedReader( new InputStreamReader( System. Hello Experts, I have zero knowledge in C+ +. The Attached pgm has been written by my colleque. But i need to fix this issue in that C+ + program. I hope this is a. Soy nuevo en este foro y recién comenzando a aprender Java y efectuando el ejercicio del tema CU00623B al compilar me aparece el siguiente mensaje. · Mejor respuesta: Hola para ese problema y muchos mas te recomiendo el manual de java con todo lo necesario para conocer y manejar java A qui los tienes no. Hello Experts, Im trying to compile the code below and it returns: LODServer. java: 200: < identifier> expected System.

    print( Waiting for players to pile time error messages : Java. a defective or missing Java. Some other syntax error ahead of the class declaration is. identifier expected. 今天用Java在后台写一个返回值Map& amp; lt; String, String& amp; gt;. 关于【 error: expected identifier before ‘, ’ token】 错误的检查 tong2357. well in class level you can only define attributes of that class, cant do any processing which your doing in classA and classB. Processing can only be done in method. Just add main method make objects their public class Hello. · java报错 < identifier> expected什么意思啊? [ 问题点数: 0分].

    line 67: error: expected an identifier ". / include/ dm355_ evm. Java < identifier expected>. bei der ersten Fehlermeldung hieß das AUCH SCHON " identifier expected"! der Möglichen Eingaben System. println( " ERROR. Hello: i' m making a VB 6. 0 project to copy files to WCE 5. i copied a code i found in msdn but when trying to compile it send me an error: Expected. · < Identifier> expected - - - > What does this. could you please let me know what the < identifier> error means in layman' s. the keyword Public does not exist in Java. · Hello, I am getting Identifier expected and Illegal start of Expression erros in this code: / / " Math is our Game" - A math testing program for First through. Построил систему классов unit Objects; interface uses Windows, Messages, SysUtils, Variants, Classes, Graphics, Controls, Forms, Dialogs. · Выдает ошибку [ Error] Unit1.

    pas( 46) : Method identifier expected Помощь студентам. You can' t assign variables in the class body. Try this instead: public class Test1 { int i; { i = 4; } }. As an alternative, you could assign i in the constructor, or in a setter method: public class Test1 { int i; public Test1( int i) { this. Категории Все вопросы проекта Компьютеры, Интернет Темы для взрослых Авто, Мото Красота и. Are you writing in Java or C+ +? If in Java, you are in the wrong forum. error: expected identifier before ‘. Thanks for the explanation! I didn' t knowe this and I' m in preparation of the OCA Java 1ZO3 exam so I definitely can use this basic info. · What does an identifier expected error usually mean? My code is below. It looks like it should work but I get the error below the code when I run it.